1. 为什么今天还要学AMBA总线——一个被低估的芯片底层语言很多人一听到“CPU总线”就下意识想到主板上的PCIe插槽、内存插槽或者干脆联想到“已经过时”的FSB前端总线。但现实是你每天用的手机、智能手表、车载中控、工业传感器甚至刚发布的某款AI边缘计算模组其内部最核心的数据通路90%以上都不是传统意义上的“总线”而是基于AMBA规范构建的一套片上互连网络。它不露面却无处不在没有物理接口却决定着整个SoC的性能天花板与功耗底线。AMBAAdvanced Microcontroller Bus Architecture不是某个厂商的私有协议而是ARM公司于1996年首次提出、持续演进至今的开放总线架构标准。它早已超越“微控制器总线”的原始定位成为全球SoC设计的事实基础设施。你手里的旗舰手机SoC里CPU集群、GPU、NPU、ISP、DDR控制器、DMA引擎、安全模块……这些模块之间如何协商带宽、如何避免死锁、如何保证低延迟访问、如何实现地址空间隔离——背后全是AMBA协议在调度。它不像Linux内核那样有源码可读也不像Python那样有交互式解释器但它比任何软件层都更真实地定义了“硬件能做什么、不能做什么、做多快、耗多少电”。我最早接触AMBA是在某高校实验室参与一款RISC-V SoC验证项目时。当时团队花两周调试一个看似简单的DMA传输失败问题最终发现根源是AXI协议中AWVALID/ARREADY握手时序未对齐而仿真波形里根本看不出异常——因为逻辑综合后插入的寄存器级延迟在RTL级仿真中被默认忽略。那次踩坑让我彻底明白AMBA不是“学完就能用”的工具课它是理解现代芯片行为边界的语言课。它不教你怎么写驱动但教你为什么驱动要这样写它不告诉你Cache怎么命中但让你看清为什么Cache一致性协议必须依赖ACE或CHI的原子操作语义。这篇内容面向三类人一是刚转行做嵌入式底层开发的工程师常被“AXI流控”“AHB突发长度”“APB门控时钟”等术语卡住想知其然更想知其所以然二是数字IC设计初学者在UVM验证环境里反复改testcase却始终无法覆盖协议边界场景三是系统架构师在评估某款国产IP核是否适配现有总线拓扑时需要快速判断其AMBA版本兼容性与QoS能力。全文不讲抽象理论只拆解真实设计中绕不开的4个硬核断点协议分层逻辑为何如此设计、地址映射如何影响外设访问效率、流控机制怎样防止FIFO溢出、以及最关键的——为什么AXI4-Lite和AXI4-Full绝不能混用在同一子系统里。所有解释都附带实测波形片段逻辑、典型配置参数推导过程以及我在多个项目中亲手验证过的避坑清单。2. AMBA协议栈的四层结构——不是技术堆砌而是问题分治2.1 协议分层的本质把“数据怎么传”拆成四个独立命题AMBA协议栈不是按时间顺序发展的历史产物而是对SoC互连本质问题的系统性解构。它的四层结构APB、AHB、AXI、ACE/CHI对应着四个不可合并的核心诉求APBAdvanced Peripheral Bus解决的是“低速外设怎么省电”。比如UART、I2C、GPIO这类每秒只传几KB数据的模块如果让它们直接挂在高速总线上每次访问都要触发整条总线的时钟使能、地址译码、仲裁响应功耗会指数级上升。APB的设计哲学是“懒”它采用两级流水Setup Access允许主设备在地址阶段就释放总线从设备在后续周期再慢悠悠返回数据。这种“非实时响应”换来的是门控时钟粒度可达单个外设级别实测某MCU平台启用APB门控后待机电流下降37%。AHBAdvanced High-performance Bus回答的是“中速主控怎么保吞吐”。它出现在ARM7/9时代目标是替代老旧的Vicor总线。关键创新在于分离地址/数据通道单周期传输固定突发长度INCR/WRAP。这里有个易错点很多人以为AHB的“高性能”体现在频率高其实核心是零等待传输能力。当HTRANSNONSEQ且HREADY1时下一个周期就能发起新传输这要求从设备必须在1个周期内完成地址译码并准备好数据。我曾见过某SPI控制器IP因内部状态机多加了一级寄存器导致HREADY延迟1拍整个AHB总线吞吐量暴跌42%——问题不在代码而在对“零等待”物理约束的理解偏差。AXIAdvanced eXtensible Interface应对的是“异构计算怎么解耦”。这是AMBA真正的分水岭。AXI将读写通道完全分离5个独立通道AW/AR/W/R/B每个通道都有自己的VALID/READY握手机制。这种设计让CPU读内存、GPU写纹理、DMA搬数据可以真正并行互不阻塞。更重要的是它引入了ID字段——同一主设备发出的多个读请求可通过不同ID标识从设备返回时按ID匹配彻底解决乱序返回导致的请求混淆问题。某次调试图像处理流水线时我们发现YUV转RGB模块输出错位最终定位到AXI读通道ID分配逻辑错误连续两帧的Y分量请求用了相同ID导致返回数据被前一帧覆盖。ACE/CHIAXI Coherency Extensions / Coherent Hub Interface解决的是“多核缓存怎么不打架”。当SoC集成4个以上CPU核心且每个核心都有私有L1 Cache时传统MESI协议靠总线嗅探Bus Snooping已无法扩展。ACE在AXI基础上增加Snoop Request/Response通道允许Cache控制器主动发起一致性查询而CHI更进一步用基于目录Directory-based的分布式协议替代中心化仲裁把一致性决策权下放到各节点。某次移植Linux内核到8核RISC-V平台时频繁出现spinlock死锁最后发现是ACE协议中Snoop Filter配置遗漏了共享内存区域的监听掩码导致核心间Cache行状态同步失效。提示不要试图一次性掌握全部协议。建议按“APB→AHB→AXI”路径渐进学习每层重点吃透两个参数APB看PCLK与PENABLE时序关系AHB抓HREADY与HRESP握手逻辑AXI则必须搞懂ID字段生命周期与VALID/READY握手机制。ACE/CHI可先跳过等遇到多核Cache一致性问题时再回溯。2.2 版本演进不是功能叠加而是范式迁移AMBA协议版本号AMBA 2/3/4/5常被误解为“功能增强版”实则代表互连范式的代际跃迁AMBA 21999是AHB/APB双总线架构核心限制是共享总线仲裁。所有主设备竞争同一根地址/数据线带宽随主设备数量线性衰减。某款早期智能电表SoC采用AMBA 2当同时启用UART、SPI、USB三个主设备时实测有效带宽不足标称值的35%。AMBA 32003引入AXI1.0首次实现通道化分离。但此时AXI仍属“窄带宽”设计仅支持32/64位数据宽度突发长度上限16。某次移植旧版视频编码IP到AMBA 3平台因IP硬编码突发长度为32而AXI1.0最大只支持16导致传输中断。AMBA 42010是真正的工业级标准。AXI4支持128/256/512位数据总线、突发长度256、用户自定义信号USER、以及最关键的AXI4-Lite子集。Lite版砍掉突发传输与用户信号专供寄存器配置类访问。这里有个致命陷阱AXI4-Lite与AXI4-Full的握手协议不兼容某次将AXI4-Full的DMA控制器误接至AXI4-Lite的存储控制器仿真中看似正常但硅片回片后发现DMA传输随机丢包——因为Lite版不识别FULL版的AWBURST信号将其默认为INCR导致地址计算错误。AMBA 52013聚焦一致性扩展。ACE在AXI4基础上增加Snoop通道CHI则重构为网状互连Mesh Interconnect支持动态QoS调度。某车规级SoC采用AMBA 5 CHI通过配置CHI Link的Credit阈值将ADAS视觉处理任务的内存带宽保障率从68%提升至92%实测AEB响应延迟降低17ms。注意协议版本兼容性不是向下兼容而是生态绑定。AMBA 4 IP核可集成到AMBA 5系统中但必须通过桥接器Bridge转换协议且桥接器本身会引入1-3个周期延迟。某项目为节省成本直接复用AMBA 4 DDR控制器结果在AMBA 5平台实测中高频场景下因桥接延迟导致DDR预充电命令冲突出现偶发性数据错乱。3. 地址映射与总线矩阵——看不见的交通管制员3.1 地址空间不是一张白纸而是分层规划的行政区划SoC的地址空间从来不是线性平铺的。以典型ARM Cortex-A系列SoC为例4GB地址空间被严格划分为多个功能区地址范围大小用途关键约束0x0000_0000–0x3FFF_FFFF1GB外设寄存器必须使用APB或AXI-Lite访问禁止突发传输0x4000_0000–0x7FFF_FFFF1GB片上SRAM支持AXI4-Full突发但需注意Bank切换延迟0x8000_0000–0xBFFF_FFFF1GBDDR内存必须经总线矩阵路由受QoS策略调控0xC000_0000–0xFFFF_FFFF1GB预留/安全区域访问需通过TrustZone地址空间控制器这个划分不是随意指定的而是由总线矩阵Interconnect Matrix的地址译码器硬编码决定。我曾调试过一个启动失败问题BootROM从0x0000_0000开始执行但首条指令取指失败。示波器抓取AXI读地址信号发现实际发出的是0x8000_0000——原来BootROM配置寄存器被错误映射到SRAM区域而总线矩阵将该地址段路由到了未供电的DDR控制器返回全0数据。地址映射的关键在于重叠区Overlap Region的处理。当多个从设备地址范围重叠时总线矩阵按优先级顺序匹配。某次添加新安全协处理器时将其地址设为0x0000_1000–0x0000_1FFF恰好与原有UART寄存器0x0000_0000–0x0000_1FFF重叠。由于安全模块优先级更高所有对UART的访问都被劫持导致串口调试完全失灵。解决方案不是修改地址而是调整总线矩阵中的优先级寄存器将UART设为最高优先级。3.2 总线矩阵不是无脑转发而是带策略的流量调度器现代SoC不再用简单仲裁器而是采用可编程总线矩阵如ARM CoreLink NIC-400。它像城市交通指挥中心不仅负责路径选择还实施QoS管控带宽保障Bandwidth Guarantee为实时任务预留最小带宽。例如设定ADAS视觉模块对DDR的访问带宽不低于800MB/s即使其他模块满负荷运行该保障仍生效。延迟上限Latency Bound对关键路径设置最大往返延迟。某次调试音频播放卡顿发现I2S控制器读取音频Buffer时平均延迟达12μs超限5μs追查发现总线矩阵未给I2S分配足够Credit导致其请求在队列中等待过久。优先级抢占Priority Preemption高优先级请求可中断低优先级传输。但这里存在经典陷阱AXI协议规定同一ID的请求必须按序完成。若高优先级DMA请求抢占了低优先级CPU的AXI读事务而两者ID相同则CPU事务会被挂起直至DMA完成反而加剧延迟。正确做法是为不同主设备分配独立ID空间。实测某款SoC的总线矩阵配置技巧先用逻辑分析仪捕获典型工作负载下的AXI地址/数据波形统计各主设备的峰值带宽需求在NIC-400配置工具中为每个主设备端口设置Base Credit基础信用值与Max Burst最大突发长度对实时性要求高的模块如Display Controller开启“Low Latency Mode”使其请求跳过常规仲裁队列最后通过仿真验证注入压力测试流量观察各端口的实际带宽分配是否符合预期。实操心得总线矩阵配置不是一次性的静态设置。某项目量产时发现高温环境下显示拖影最终定位到是温度升高导致DDR控制器响应延迟增加而总线矩阵的Credit阈值未随温度动态调整。解决方案是在SoC中集成温度传感器通过固件动态调节NIC-400的QoS参数。4. AXI流控机制深度解析——为什么你的FIFO总是溢出4.1 VALID/READY握手机制数字电路里的“红绿灯系统”AXI的流控核心是双向握手协议它比传统总线的单向应答更健壮但也更难调试。以写地址通道AW为例主设备置AWVALID1表示“我有地址要发”但从设备只有在准备好接收时才置AWREADY1只有当AWVALID与AWREADY同时为1时地址才被采样此时主设备必须保持AWADDR稳定至少1个周期若从设备暂时无法接收如内部FIFO已满可拉低AWREADY主设备需保持AWVALID与AWADDR不变直到AWREADY变高。这个机制看似简单但隐藏着三个致命细节VALID保持规则AXI协议规定一旦VALID置1主设备必须持续驱动对应信号ADDR/DATA/ID等直至READY变高。某次调试中主设备在AWREADY0时错误地改变了AWADDR导致从设备采样到错误地址引发内存越界写。READY撤销时机从设备可在任意时刻撤销READY拉低但必须确保在VALID1期间撤销不会造成采样错误。实测发现若从设备在VALID变高后的第1个周期就撤销READY某些综合工具生成的逻辑会出现亚稳态需插入两级同步器。ID字段的语义约束同一ID的请求必须按序完成。这意味着若主设备发出ID0的写请求A随后发出ID0的写请求B从设备必须先完成A再处理B。某次优化DMA性能时为提升吞吐将ID字段循环使用0→1→0结果导致写入内存的数据顺序错乱。4.2 FIFO深度计算不是越大越好而是精准匹配总线矩阵与IP核之间的FIFO深度是流控设计中最易被忽视的环节。计算公式如下FIFO深度 ⌈(主设备最大突发长度 × 数据位宽) ÷ (从设备最小响应周期 × 数据位宽)⌉ 安全余量以典型场景为例主设备DMA控制器最大突发长度256数据位宽512bit从设备DDR控制器最小响应周期CAS Latency为12个DDR时钟周期DDR时钟为1600MHz → 周期625ps → 12周期≈7.5ns系统时钟200MHz周期5ns计算过程DMA单次突发数据量 256 × 512bit 131,072bit 16,384ByteDDR最小响应时间 7.5ns对应系统时钟周期数 7.5ns ÷ 5ns 1.5 → 向上取整为2个周期FIFO深度 ≥ 16,384Byte ÷ (512bit ÷ 8) 16,384Byte ÷ 64Byte 256 安全余量建议20%→308 entries但实际项目中我们设为320 entries。原因在于DDR控制器在刷新Refresh期间会暂停响应最长暂停时间约100ns20个系统时钟周期此期间DMA若持续发送请求FIFO需额外容纳20 × 64Byte 1280Byte数据320 × 64Byte 20,480Byte 1280Byte满足要求。常见错误用“经验法则”设FIFO深度。某项目盲目采用“通用深度128”结果在DDR刷新时DMA触发FIFO溢出中断导致图像采集丢帧。教训是FIFO深度必须基于具体IP核的时序参数计算而非套用模板。4.3 流控失效的三大征兆与定位方法当AXI流控失效时系统不会立即崩溃而是呈现渐进式异常。以下是我在多个项目中总结的诊断树征兆可能原因定位方法数据错乱Data CorruptionREADY信号毛刺导致部分数据被错误采样用逻辑分析仪捕获AWVALID/AWREADY波形检查是否存在1周期的READY脉冲传输卡死Stall主设备VALID持续为1但从设备READY长期为0检查从设备FIFO状态信号如FULL/EMPTY确认是否因下游阻塞导致READY无法置高性能骤降Throughput Drop多主设备竞争时某通道READY响应延迟突增在总线矩阵端口插入ILAIntegrated Logic Analyzer统计READY有效延迟分布实测案例某AI加速卡出现推理延迟波动波动范围达±15ms。抓取AXI读通道波形发现GPU读取权重数据时ARREADY信号存在周期性100ns延迟。深入追踪发现该延迟与DDR刷新周期完全同步——原来总线矩阵未配置DDR刷新优先级导致刷新请求抢占了GPU的ARREADY响应资源。解决方案是在NIC-400中为GPU端口设置“Refresh Bypass”标志使其请求不受刷新影响。5. 实战避坑指南——那些文档里不会写的血泪教训5.1 AXI ID字段的四大禁忌ID字段是AXI协议的灵魂但也是最容易误用的部分。根据我参与的7个SoC项目的调试记录总结出必须规避的四个反模式ID复用跨事务类型将同一ID既用于读请求又用于写请求。AXI协议允许这样做但多数从设备IP尤其是DDR控制器内部用ID索引状态机读写混用会导致状态机错乱。某次DDR写入失败最终发现是CPU用ID3发写请求而GPU用同一ID3发读请求DDR控制器将两者视为同一事务序列。ID空间未对齐主设备ID宽度为4bit0-15但只使用ID0-7剩余ID8-15未禁用。当总线矩阵进行ID映射时未使用的ID可能被路由到错误从设备。某项目中ID12的请求被意外路由至安全模块触发非法访问中断。ID生命周期管理缺失主设备在发出请求后未跟踪ID对应的响应是否返回就重复使用该ID。AXI协议要求ID在BRESP返回后才可复用。某次DMA传输完成后驱动程序未等待BRESP即启动新任务导致新任务ID与未完成任务冲突。ID与Cache行绑定错误在ACE一致性协议中ID需与Cache行地址关联。若主设备为同一Cache行分配不同ID会导致Snoop Filter无法正确追踪行状态。某多核系统出现Cache一致性失效根源是L2 Cache控制器为同一行分配了ID1CPU0和ID2CPU1。解决方案在UVM验证环境中编写ID生命周期检查器ID Lifecycle Checker监控每个ID的AW/AR/B通道使用状态自动报错ID复用、ID泄漏等违规行为。5.2 时钟域交叉CDC的隐形杀手AMBA总线常跨越多个时钟域如CPU时钟、DDR时钟、外设时钟CDC处理不当是硅片回片后最棘手的问题之一。三个高频雷区单比特信号未同步将AXI的VALID信号直接跨时钟域使用。某项目中200MHz时钟域的AWVALID接入100MHz时钟域未加两级触发器同步导致接收端采样到亚稳态出现随机地址丢失。多比特信号未格雷码编码地址总线跨时钟域时若直接传递二进制地址高低位变化不同步会造成地址错乱。某次DDR地址错位抓取波形发现地址线A15-A12在跨域后出现0x3→0x4的跳变实为二进制0011→0100中A14提前翻转所致。解决方案对地址总线使用格雷码编码或采用FIFO进行跨域传输。握手协议未完整同步AXI的VALID/READY是双向信号必须分别同步。常见错误是只同步VALID而READY仍用原时钟域。正确做法是在接收端用本地时钟对VALID采样生成ready_local再用ready_local控制本地READY输出同时将本地READY同步回发送端作为valid_ack。实操技巧在Synopsys VCS仿真中启用defineCDC_CHECK编译选项工具会自动插入CDC检查断言对未同步信号报错。某项目因此提前发现3处CDC隐患避免了流片风险。5.3 电源域分割与总线唤醒的协同设计现代SoC普遍采用多电源域Power Domain设计以降低功耗。但电源域关闭时其连接的总线节点可能处于未知状态。某低功耗物联网SoC出现休眠唤醒后外设失联根本原因是UART所在电源域关闭时其APB接口的PSEL信号被拉低唤醒后CPU通过APB读取UART状态寄存器但PSEL未及时恢复导致总线矩阵将请求路由至默认从设备返回0xFF驱动程序误判为UART硬件故障进入错误处理流程。解决方案需软硬协同硬件层面在电源管理单元PMU中为每个电源域配置“总线唤醒序列”确保PSEL等关键信号在域上电后首个时钟周期即有效软件层面驱动初始化时不直接读取外设寄存器而是先写入唤醒令牌Wake Token至PMU寄存器等待PMU返回“域就绪”中断后再访问外设。血泪教训某项目为缩短唤醒时间将PMU唤醒序列压缩至1个时钟周期结果在-40℃低温环境下因晶体管开关延迟增加PSEL信号建立时间不足导致10%的芯片唤醒失败。最终方案是增加温度传感器反馈动态延长唤醒序列。6. 工具链实战——从仿真到硅片的全流程验证6.1 协议检查器Protocol Checker的定制化部署商用EDA工具如Cadence Perspec、Synopsys VC SpyGlass提供标准AMBA协议检查但无法覆盖项目特有约束。我习惯在UVM验证平台中集成自研协议检查器重点监控三类场景地址对齐检查AXI4要求32位数据传输地址必须4字节对齐64位需8字节对齐。检查器实时比对AWADDR[1:0]与AWSIZE不匹配则报错。某次发现DMA控制器在传输非对齐地址时未按协议返回SLVERR而是静默丢弃数据。突发长度合规性AXI4规定突发长度必须为2^N1,2,4...256。检查器捕获AWLEN信号对非法值如3,5,7触发断言。某IP核文档声称支持“任意长度突发”实测发现AWLEN3时内部逻辑错误。响应超时检测为每个请求ID启动超时计数器若BRESP/ RRESP在N个周期内未返回则标记为“悬挂请求”。某次调试中该检查器捕获到ID5的写请求在10000周期后仍未返回最终定位到DDR控制器中一个未清除的错误状态寄存器。部署技巧将协议检查器封装为独立UVM组件通过TLM端口接入验证平台。这样既不影响主验证流程又可单独启用/禁用特定检查项便于回归测试。6.2 逻辑分析仪的AXI波形解码实战芯片回片后逻辑分析仪如Saleae Logic Pro 16是定位总线问题的终极武器。关键在于正确配置解码参数采样率设置必须≥总线频率的4倍。AXI4在200MHz时钟下需≥800MS/s采样率否则无法重建VALID/READY边沿。信号分组将5个AXI通道AW/AR/W/R/B分别分组避免信号混淆。某次误将AWADDR与WDATA混在同一组导致解码器将地址误识别为数据。ID字段映射在解码器中手动配置ID位宽如ID[3:0]否则无法关联请求与响应。某项目中因未配置ID映射解码器显示“Unknown ID”无法追踪事务流。实测波形分析案例问题图像采集帧率不稳定偶发丢帧。抓取AXI读通道波形解码后发现ARADDR序列正常0x8000_0000, 0x8000_0100, ...但RDATA返回存在大量0x0000_0000空包进一步检查RRESP发现大量SLVERRSlave Error定位到ISP模块的地址译码逻辑错误将0x8000_XXXX地址段误判为保留区返回错误响应提示在量产测试中将逻辑分析仪配置保存为模板每次测试自动加载大幅提升问题复现效率。6.3 硅片回片后的总线压力测试方案流片后必须进行严苛的压力测试而非简单功能验证。我的标准测试集包含带宽饱和测试用DMA控制器以最大突发长度、最高频率向DDR灌入伪随机数据持续1小时监控误码率与温度变化。混合负载测试CPU执行矩阵乘法占CPU总线、GPU渲染三角形占GPU总线、DMA搬运视频流占DDR总线三者并发观察各通道带宽分配是否符合QoS配置。异常注入测试通过JTAG强制修改总线矩阵寄存器模拟Credit耗尽、优先级反转等异常验证系统能否优雅降级如自动切换至低分辨率模式。某次压力测试中混合负载下DDR带宽分配偏离预期达23%。深入分析发现总线矩阵的QoS算法在突发长度64时存在计算偏差。解决方案是在固件中动态调整DMA的突发长度避开算法缺陷区间。经验压力测试必须覆盖“最差情况”Worst Case。某项目仅测试常温量产时高温环境出现总线超时因高温下晶体管延迟增加原定的20ns响应窗口被突破。后续所有压力测试均在-40℃、25℃、105℃三温区进行。7. 学习路径与资源推荐——少走三年弯路的实践地图7.1 从零构建AMBA学习闭环AMBA学习最大的误区是“只看文档不碰硬件”。我推荐按此闭环推进文档精读下载ARM官方《AMBA AXI Protocol Specification》重点精读第3章Transaction Rules与第5章Handshake Timing配合时序图手绘波形。仿真验证用开源AMBA VIP如OpenTitan的AXI VIP搭建最小系统在ModelSim中跑通读写事务用波形观察VALID/READY交互。FPGA实测在Xilinx Zynq上部署AXI GPIO IP用SDK编写裸机程序用ChipScope抓取真实AXI波形对比仿真与实测差异。逆向分析下载某开源RISC-V SoC如PicoRV32阅读其总线矩阵源码通常用Chisel或SystemVerilog编写理解地址译码与仲裁逻辑。关键提醒不要陷入“协议细节完美主义”。AXI协议文档厚达200页但实际项目中90%问题集中在AW/AR/W/R/B五通道的握手逻辑与ID管理。先攻克这20%核心再逐步扩展。7.2 高价值免费资源清单ARM官方文档库搜索“ARM AMBA Protocol Specifications”获取最新AXI/ACE/CHI规范PDF。注意文档中所有时序图都标注了“Typical”字样实际硅片参数需以IP核Datasheet为准。OpenTitan项目Google开源的可信SoC项目其AXI总线矩阵TL-UL Bridge代码完全公开是学习总线互联设计的绝佳范本。Xilinx Vivado IP Catalog免费提供AXI Interconnect、AXI SmartConnect等IP核可生成例化代码与仿真测试平台无需License即可学习。GitHub AMBA Tutorials搜索“AMBA AXI tutorial”找到由资深IC工程师维护的波形分析仓库含真实项目中捕获的异常波形与修复方案。7.3 我的个人经验沉淀在某次为国产RISC-V核适配AMBA总线时我总结出三条铁律第一律永远相信波形不信文档。某IP核文档声称支持AXI4-Full但实测发现其不支持AWLOCK信号。波形显示AWLOCK始终为0而文档未注明该信号被忽略。第二律调试从最慢的模块开始。总线问题90%源于响应最慢的从设备通常是DDR或Flash控制器。先确认其时序参数如tRCD、tRP与总线矩阵配置匹配再排查其他模块。第三律版本号只是起点Datasheet才是终点。AMBA 4是标准但每个IP核对标准的实现都有差异。必须逐字阅读该IP核的Datasheet重点关注“Protocol Compliance”章节与“Timing Parameters”表格。最后分享一个小技巧在SoC顶层模块中为每个AXI通道添加LED指示灯如AWVALID亮绿灯AWREADY亮红灯通过LED闪烁模式快速判断总线活性。某次现场调试中仅凭LED节奏就判断出是DMA控制器未启动而非总线故障节省了3小时定位时间。
阅读完成 · 觉得有帮助?