首页 / 资讯中心 / 文章详情

AXI to APB Bridge实战:协议转换、超时机制与多从机汇聚避坑

AXI to APB Bridge实战:协议转换、超时机制与多从机汇聚避坑 ★ FEATURED ARTICLE
简介面向FPGA与SoC硬件工程师、总线互联设计者及嵌入式开发者的Xilinx AXI to APB Bridge v3.0 LogiCORE IP产品指南聚焦AXI4-Lite从接口到APB主接口的桥接实现可用于理解IP功能、端口定义、时序行为与Vivado中的定制生成流程并为涉及总线安全、TrustZone/TEE的外设访问隔离设计提供参考资料。资源包仅含1个PDF文档大小约1.11MB内容覆盖特性摘要、AXI4-Lite与APB接口说明、标准符合性、资源占用、端口描述、时钟与复位、时序图、约束、仿真、综合实现及示例工程目录与仿真方法章节组织完整便于按设计流程检索。已有1859人学习适合需要快速查阅官方IP参数、搭建桥接验证环境或排查集成问题的读者作为手头文档。1. 从一次读操作挂死说起这座 AXI to APB Bridge 到底补的是哪块板有个同学做总线互联的课设处理器从 AXI4-Lite 侧读一个 APB 温度传感器寄存器波形上m_apb_psel拉起来了m_apb_pready却一直不回头仿真跑到 10us 卡死他翻了两天代码以为是状态机写错了。问题不在状态机在于他用错了连接方式APB 从机根本不会自己「回答」AXI 主设备中间必须有一层把 AXI4-Lite 的握手翻译成 APB 的 setup/access 两相时序这就是 AXI to APB Bridge 干的活。这份 PG073 文档描述的是一个 32 位 AXI4-Lite 从接口 32 位 APB3/APB4 主接口的软核功能很收敛协议翻译、地址透传、读优先、可选超时。适合三类人照着做——做 SoC 互联毕设需要给 AXI 主接一堆低速外设的、要在一套 APB 子系统外面开一个 AXI 入口的、以及需要在 APB4 上用pprot传递 secure/normal 属性来做安全域隔离TrustZone、TEE 那类场景的。下面按需求、架构、实现、避坑、验收的顺序拆开讲。2. 需求与选型为什么低速外设挂在 AXI 上非走一座桥不可2.1 三类典型场景与被排除的三种做法第一类场景是处理器主口带一堆低速外设。软核或 SoC 里的处理器通常只吐出 AXI4-Lite 或者 AXI4 主口而 UART、GPIO、I2C 控制器、看门狗、定时器这类东西天然是 APB 从机——单周期 setup、单周期 access、无 burst、无 outstanding引脚少面积小。硬把 AXI 灌进去外设得自己实现五通道握手成本反而更高。桥在这里的位置很明确AXI 侧当从APB 侧当主一次 AXI4-Lite 事务对应一次 APB 传输。第二类场景是已有 APB 子系统需要开个入口。很多第三方外设 IP 或者上一届留下来的 APB 模块接口只有psel/penable/pwrite/paddr/pwdata/pready/prdata。要把它接进新架构最省事的做法不是改外设而是在外面加一座桥AXI 侧照常挂到互联矩阵上。这样老模块零改动新架构也能统一编址。第三类场景跟安全相关。APB4 相比 APB3 多了pstrb和pprot两个信号pprot[2:0]携带的是这次传输的保护等级普通还是特权、安全还是非安全、数据访问还是取指。做安全域划分时CPU 处在安全世界TEE访问某个外设这条属性得一路透传到 APB 从机由从机或它前面的过滤器来判权限。桥本身不做过滤但它必须把pprot原样送出去否则下游根本不知道自己被谁访问。这一点在选 APB3 还是 APB4 时是决定性的。被排除的做法有三种都有人踩过。第一种是自己写个状态机做翻译看起来省 IP实际上 APB 的pready可以无限拉长、AXI 的awvalid/wvalid可以乱序到达、读写同时请求还要仲裁写完调通的时间远超预期而且时序收敛很难看。第二种是让 AXI 主直接接 APB 从机协议层根本不兼容pready没人驱动就是开头那个挂死。第三种是用互联矩阵一路铺到外设问题是矩阵出口还是 AXIAPB 外设照样挂不上白白多占一片逻辑。2.2 接口参数与技术选型五个必须先定死的量选型阶段真正要拍板的只有五项剩下的都是默认值。数据位宽没有选择余地AXI 地址和数据、APB 地址和数据全部固定 32 位。这一点必须在需求阶段就写进方案因为它直接决定了地址空间是 4GB 平坦空间也决定了你不能指望这座桥做位宽转换。如果外设是 8 位或者 16 位寄存器只能在外设侧自己对齐或者在 APB 从机里做字节选通。APB 协议版本要在 APB3 和 APB4 之间选。APB3 只有基本信号APB4 额外带m_apb_pstrb[3:0]和m_apb_pprot[2:0]。判断标准很土但很有效外设需不需要按字节写需要就 APB4因为pstrb是唯一能表达「只更新哪几个字节通道」的信号外设访问需不需要区分安全属性需要就 APB4。两个都不需要选 APB3面积小一点端口也干净。这个选择是通过 IP 配置里的一个 generic 决定的选错之后综合会直接报信号不存在或者更糟——字节写变成整字覆盖寄存器被莫名改写。从机数量决定了m_apb_psel和m_apb_pready的位宽以及m_apb_prdata有几组。文档里给到的组合是 1、4、8、16 个从机其中 16 从机那一档prdata会展开成m_apb_prdata到m_apb_prdata16共 16 组 32 位总线。这是个很容易被低估的成本不是逻辑不够是顶层端口列表会变得非常长手写例化极容易错位。我一般的做法是超过 8 个从机就用数组端口或者脚本生成例化不手敲。超时值是可选项但强烈建议打开。它的含义是APB 从机在多少个时钟周期内没给出pready桥就判定这次传输失败在 AXI 侧返回SLVERR。不开的话一个不响应的从机能让整条 AXI 事务永久挂起上层 CPU 就卡在那儿连看门狗都救不回来。时钟比例只有 1:1 一种AXI 时钟和 APB 时钟必须同频同相。这条在选型时最容易被忽略因为很多人下意识觉得「桥嘛总能跨时钟域」。它不能。文档写得很清楚只支持 1:1 同步时钟比。如果 APB 侧确实需要降频正确做法是在桥外面单独做时钟分频和外设侧同步而不是指望桥内部处理。器件支持范围覆盖 7 系列、UltraScale 以及带处理器的 SoC 器件家族资源占用在 7 系列上实测如下其余参数取默认值从机数APB 版本超时值Slice触发器LUTFMAX (MHz)1APB4641193642862004APB4641363703722008APB46417438647520016APB364181402549200这张表的价值不在于绝对值在于趋势从机数从 1 涨到 16LUT 从 286 涨到 549几乎翻倍触发器基本不动。说明面积主要花在地址解码和读数据多路选择上而不是流水寄存器。做面积预算时按这个比例估就够了。还有三条文档里写得很轻、但对落地影响极大的事实设计文件是 VHDL提供例程和 test bench也都是 VHDL不提供约束文件也不提供仿真模型。翻译成人话就是——你不会拿到一个现成的 XDC时钟约束、引脚约束、时序例外全部得自己在顶层写仿真的时候也没有预编译的网表模型可用只能跑 RTL 或者自己生成。这两点后面会单独展开。3. 总体架构设计地址解码、读写仲裁与超时监控的三段式结构3.1 模块划分与信号流向这座桥内部可以拆成三块边界很清楚。第一块是 AXI4-Lite 从接口。它对外呈现标准的五个通道写地址s_axi_awaddr/awvalid/awready、写数据s_axi_wdata/wstrb/wvalid/wready、写响应s_axi_bresp/bvalid/bready、读地址s_axi_araddr/arvalid/arready、读数据s_axi_rdata/rresp/rvalid/rready。内部它干两件事把 AXI 的四次握手收敛成一次「有传输请求」的脉冲以及把 APB 回来的结果重新打包成 AXI 的响应。所有 AXI 通道的位宽都是固定的没有参数可调。第二块是地址解码与多路复用。它接收 AXI 侧过来的地址按高位译出该选中哪个 APB 从机驱动对应的psel位反向把各个从机的prdata、pready、pslverr汇聚成一路送给 APB 主接口。这一块是纯组合逻辑为主也是 LUT 消耗的大头。第三块是 APB 主接口。它按 APB3/APB4 的时序把请求打出去setup 阶段拉高psel、给出paddr/pwrite/pwdataaccess 阶段拉高penable然后等pready。如果开了超时这里还挂着一个计数器专门盯pready什么时候回来。信号流向是单向清晰的AXI 从接口 → 地址解码 → APB 主接口 → 外部从机 →prdata/pready/pslverr回流 → 多路选择 → AXI 从接口 → 主机。没有反向路径没有跨时钟域因此不存在亚稳态问题这对时序收敛是极大的利好。有一处设计上的取舍值得说清楚桥内部并不缓存写数据。AXI 的写地址和写数据是两个独立通道可能不同周期到达。桥的做法是等两个通道都齐了才发起 APB 传输中间用握手信号顶着。这意味着如果主机先发地址、迟迟不发数据APB 侧就一直不动。这不是缺陷是 AXI4-Lite 允许的行为但做验证的时候必须专门测这个场景否则容易漏掉。3.2 地址映射与读优先仲裁地址处理这块文档里有一句很容易被跳过去的话AXI 存储器和 APB 存储器是同一个完整的 32 位4GB空间桥不修改地址APB 上看到的地址和 AXI 上收到的一模一样。这意味着两件事。第一地址分配是在系统级做的不是在桥里做的。你得在方案阶段就画出一张地址表明确哪个区间给哪个外设桥只负责把落在该区间的访问转发出去。第二如果你需要地址窗口重映射比如 AXI 侧从 0x4000_0000 开始外设只认 0x0000_0000不能指望配置桥的参数解决得在桥前面加一级地址偏移或者让外设自己带地址译码。我见过有人反复翻 IP 配置界面找「base address」参数找了半天没找到因为压根没有。一张典型的地址分配表长这样写进设计文档里答辩时直接用从机编号外设地址区间大小说明0UART00x4000_0000 – 0x4000_0FFF4 KB调试串口1GPIO0x4001_0000 – 0x4001_0FFF4 KB按键与 LED2TIMER0x4002_0000 – 0x4002_0FFF4 KB系统节拍3I2C0x4003_0000 – 0x4003_0FFF4 KB传感器总线仲裁策略是读优先。文档明确写了当 AXI4-Lite 接口上同时有写请求和读请求时读请求优先级高于写请求。这个策略在低速外设场景下是合理的读通常是阻塞式的CPU 取指令、轮询状态写可以缓一缓。但它带来一个必须提前想清楚的问题——如果读请求持续不断写会不会饿死在 AXI4-Lite 单 outstanding 的约束下同一时刻只有一个未完成事务所以严格意义上的饿死不会发生但写延迟会被拉长。做实时性要求高的方案时这一点要写进风险分析里。还有一个细节APB 侧同一时刻只能有一个psel有效。地址解码必须保证互斥不能出现两个从机同时被选中。这在地址区间不重叠时自然成立但如果有人在地址表里手滑写重了一段综合不会报错仿真可能也过上板就是两个外设同时响应、prdata打架。这是典型的玄学问题后面避坑章会专门讲。3.3 数据相位超时与 SLVERR 上报超时机制是这座桥最值得单独讲的设计点因为它决定了一套系统在异常情况下是「优雅报错」还是「彻底卡死」。工作原理很朴素从 APB 的 access 阶段开始penable拉高启动一个递减计数器初值就是配置的超时值。每个s_axi_aclk周期减一。如果计数器归零之前pready回来了计数清零传输正常结束如果归零了pready还没来桥就主动终止这次 APB 传输并在 AXI 侧把bresp或rresp置成SLVERR2b10告诉主机「这次访问出错了」。用一段简化代码表达这个逻辑方便理解计数器挂在哪个位置// 超时监控仅在 APB access 阶段计数 // TIMEOUT_VAL 由 IP 参数决定取值需大于最慢外设的响应周期数 localparam TIMEOUT_VAL 64; reg [15:0] timeout_cnt; reg timeout_hit; always (posedge s_axi_aclk or negedge s_axi_aresetn) begin if (!s_axi_aresetn) begin timeout_cnt 16d0; timeout_hit 1b0; end else if (apb_access_phase !m_apb_pready) begin // access 阶段且从机未响应开始/继续倒计时 if (timeout_cnt TIMEOUT_VAL - 1) begin timeout_hit 1b1; // 计数到顶标记超时 timeout_cnt 16d0; end else begin timeout_cnt timeout_cnt 16d1; end end else begin timeout_cnt 16d0; // 传输完成或不在 access 阶段清零 timeout_hit 1b0; end endapb_access_phase是内部产生的指示信号等价于m_apb_psel m_apb_penable。TIMEOUT_VAL的取值需要按最慢外设来估如果一个 I2C 控制器做一次传输最长要 40 个时钟周期那 64 就偏紧取 128 或 256 更稳。取太小会误报正常传输被判成错误取太大则失去意义CPU 还是要等很久。我一般按「最慢外设最坏情况 × 2」来定留一倍余量。超时之后还有一个动作容易漏APB 侧的psel和penable必须立刻撤回。因为此时从机可能正处于某种异常状态如果不撤信号它可能在下个周期突然把pready拉起来而此时 AXI 侧已经报了错两边状态就错位了。这类错位在仿真里不一定显现上板后表现为「第一次访问报错后面全乱」非常难查。m_apb_pslverr是另一个错误来源。它位宽是c_apb_num_slaves也就是每个从机一根线汇聚成一个向量。从机自己检测到错误比如访问了保留寄存器时会拉高对应位桥把这个信息合并进 AXI 的响应里。所以最终 AXI 侧的SLVERR可能来自两个地方超时或者从机主动报错。做调试时要在波形上区分这两条路径否则你会花很长时间去查一个其实是从机主动报的错。最后提一句安全属性。如果配成 APB4m_apb_pprot[2:0]会跟着每次传输一起送出去桥不做任何修改。做总线安全bus security方案时这意味着权限判定的责任在下游要么 APB 从机自己检查pprot决定是否响应要么在桥和从机之间插一个过滤器。桥只保证属性不丢不保证属性被遵守——这一点在写安全设计文档时必须说清楚别把责任错配给桥。4. 关键实现端口连接、多从机汇聚与约束写法4.1 顶层例化与参数配置IP 生成之后拿到的是一份 VHDL 设计文件和一份例程。如果整个工程是 Verilog 为主最省事的做法是在 IP 配置阶段选择生成 Verilog 包装或者直接例化黑盒。下面给出顶层例化的骨架端口名与文档一致// AXI to APB Bridge 顶层例化 // 参数名以 IP 配置界面实际生成的为准此处为常见命名 axi_apb_bridge_0 u_axi_apb_bridge ( // 时钟与复位1:1 同步APB 侧无独立时钟 .s_axi_aclk (s_axi_aclk), .s_axi_aresetn (s_axi_aresetn), // AXI4-Lite 从接口位宽固定 32 .s_axi_awaddr (s_axi_awaddr), .s_axi_awprot (s_axi_awprot), .s_axi_awvalid (s_axi_awvalid), .s_axi_awready (s_axi_awready), .s_axi_wdata (s_axi_wdata), .s_axi_wstrb (s_axi_wstrb), .s_axi_wvalid (s_axi_wvalid), .s_axi_wready (s_axi_wready), .s_axi_bresp (s_axi_bresp), .s_axi_bvalid (s_axi_bvalid), .s_axi_bready (s_axi_bready), .s_axi_araddr (s_axi_araddr), .s_axi_arprot (s_axi_arprot), .s_axi_arvalid (s_axi_arvalid), .s_axi_arready (s_axi_arready), .s_axi_rdata (s_axi_rdata), .s_axi_rresp (s_axi_rresp), .s_axi_rvalid (s_axi_rvalid), .s_axi_rready (s_axi_rready), // APB 主接口APB4 才有 pprot / pstrb .m_apb_paddr (m_apb_paddr), .m_apb_pprot (m_apb_pprot), .m_apb_psel (m_apb_psel), // 位宽 从机数 .m_apb_penable (m_apb_penable), .m_apb_pwrite (m_apb_pwrite), .m_apb_pwdata (m_apb_pwdata), .m_apb_pstrb (m_apb_pstrb), .m_apb_pready (m_apb_pready), // 位宽 从机数 .m_apb_prdata (m_apb_prdata), // 单从机时 32 位多从机时多组 .m_apb_pslverr (m_apb_pslverr) // 位宽 从机数 );几个必须注意的点。第一s_axi_awprot和s_axi_arprot是 AXI 侧的保护属性输入它会被映射到 APB4 的m_apb_pprot如果你的方案涉及安全域隔离这条路径不能悬空否则属性永远传不出去。第二m_apb_psel、m_apb_pready、m_apb_pslverr三组都是向量位宽等于从机数例化时一定要对齐错一位就是错位一整片。第三m_apb_prdata在单从机配置下是 32 位单端口在多从机配置下会展开成m_apb_prdata到m_apb_prdataN多组端口不是向量——这是最容易在例化时搞错的细节编译报错信息通常也不会明确指出。参数方面真正影响功能的就三个APB 协议版本决定pprot/pstrb是否存在、从机数量决定三组向量的位宽、超时值决定异常响应有多快。其余都是默认。配置完之后建议把生成的参数原样抄进设计文档别只写「配置了 4 个从机」因为半年后回来改的时候你已经想不起来当时为什么是 4 而不是 5。4.2 APB 侧多从机的 psel/pready/prdata 汇聚桥输出的m_apb_psel是多根线每根对应一个从机。但 APB 从机通常只有一根pready和一组prdata所以桥的输入侧需要把这些从机反馈「汇聚」回来。这一步不在桥内部完成需要你在顶层连出来而且是多从机方案里最容易翻车的地方。pready的汇聚有一个关键原则未被选中的从机它的pready必须参与汇聚但结果无效。最稳妥的写法是先把每根pready与对应的psel相与再做或运算// 从机反馈汇聚未选中的从机不得拉高 pready // NUM_SLAVE 与 IP 配置的从机数一致 wire [3:0] pready_gated; wire [3:0] slverr_gated; assign pready_gated[0] uart_pready m_apb_psel[0]; assign pready_gated[1] gpio_pready m_apb_psel[1]; assign pready_gated[2] timer_pready m_apb_psel[2]; assign pready_gated[3] i2c_pready m_apb_psel[3]; // 同一时刻只有一个 psel 有效或起来即为当前从机的就绪 assign m_apb_pready |pready_gated; // pslverr 同理汇聚成向量交给桥 assign slverr_gated[0] uart_slverr m_apb_psel[0]; assign slverr_gated[1] gpio_slverr m_apb_psel[1]; assign slverr_gated[2] timer_slverr m_apb_psel[2]; assign slverr_gated[3] i2c_slverr m_apb_psel[3]; assign m_apb_pslverr slverr_gated;为什么要与psel因为很多简单外设的pready是常高电平它们永远当周期就绪。如果直接或起来那不管选没选中pready一直是 1桥就会认为传输瞬间完成读回的数据可能是全 0 或者别的从机残留值。这个 bug 的表现是「有的外设能读对有的读出来全是 0xFF」看起来像玄学其实就是这里少了与门。prdata的汇聚用多路选择按psel选// 读数据多路选择按 psel 选当前从机的返回值 // 默认支路不可省略否则未命中时会产生锁存器 assign m_apb_prdata m_apb_psel[0] ? uart_prdata : m_apb_psel[1] ? gpio_prdata : m_apb_psel[2] ? timer_prdata : m_apb_psel[3] ? i2c_prdata : 32h0000_0000;默认支路一定要写。少了它综合工具会推断出锁存器时序报告上会出现一条莫名其妙的路径而且上板行为随温度电压飘。这是纯组合逻辑设计里的老规矩但在总线汇聚这种地方特别容易被忘。从机数量到 8 或者 16 的时候手写这段会非常痛苦且容易错位。我的习惯是写个小脚本按地址表生成这段汇聚代码地址表和代码同源改一处两边一起改。这不是为了炫技纯粹是因为手写过一次 16 从机的汇聚错了一位查了一整天。4.3 时钟与复位1:1 同步是硬约束不是建议时钟这块没有设计空间只有遵守。整座桥只有一个时钟输入s_axi_aclkAPB 侧共用同一个时钟。不存在m_apb_pclk这种独立端口。为什么因为桥内部的状态机、计数器、地址寄存器全挂在这一个时钟域上跨时钟域需要加同步器和握手那会显著增加面积和延迟而这个 IP 的定位就是轻量级胶合逻辑不做这件事。实际工程里常见的错误是APB 外设工作在 50MHzAXI 侧跑 100MHz于是有人想「桥能不能帮我降频」。不能。正确做法是在桥和 APB 外设之间加一级时钟域处理——要么外设自己也跑到 100MHz大多数低速外设完全跑得动要么在外设侧做同步要么用单独的 APB 时钟域模块。如果强行把两个不同频率的时钟接到同一个s_axi_aclk上比如一个接系统时钟一个接分频时钟综合可能不报错但时序分析会出现跨时钟路径未约束的警告上板行为完全不可预测。复位只有s_axi_aresetn一个低有效异步复位。APB 侧没有独立复位端口。这意味着外部必须提供一个干净的、与s_axi_aclk同步释放的复位信号。异步置位、同步释放是标准写法// 异步复位、同步释放避免复位撤销时落在时钟沿附近 reg [1:0] rst_sync; always (posedge s_axi_aclk or negedge ext_rst_n) begin if (!ext_rst_n) rst_sync 2b00; else rst_sync {rst_sync[0], 1b1}; end wire s_axi_aresetn rst_sync[1];两级触发器的作用是把复位撤销的时刻对齐到时钟沿之后避免亚稳态。省掉这两级上电时偶尔会出现第一次访问失败、第二次正常的情况——这种问题极难复现一旦出现就是血泪经验。4.4 约束、综合与实现IP 不带 XDC全得自己写这是文档里最容易被忽略的一条约束文件一栏写的是 N/A。也就是说 IP 生成之后你不会拿到任何 XDC时钟定义、引脚分配、时序例外全得自己在顶层补。时钟约束是最基本的按实际频率写周期。资源表里的 FMAX 是 200MHz对应周期 5ns# 主时钟约束AXI 与 APB 共用1:1 同步 create_clock -name s_axi_aclk -period 5.000 [get_ports s_axi_aclk] # 输入输出延迟按上游互联和下游外设的实际时序填写 set_input_delay -clock s_axi_aclk -max 2.000 [get_ports s_axi_*] set_output_delay -clock s_axi_aclk -max 2.000 [get_ports m_apb_*] # 异步复位不做时序分析但只对复位网络本身生效 set_false_path -from [get_ports ext_rst_n]set_false_path这条要慎用。它只应该作用在复位信号本身绝不能顺手把整条 APB 数据路径也 false 掉——那样时序分析就形同虚设上板跑不通你都不知道为什么。我见过有人为了消掉时序违例报告直接set_false_path -from [all_inputs]报告确实干净了板子也确实不工作了。综合阶段没什么特别的标准流程走一遍。实现阶段要关注的是扇出m_apb_psel的每一位都要驱动一个外设如果从机多且布局分散扇出可能成为瓶颈这时候需要加max_fanout约束或者手动复制驱动。这个问题在 16 从机配置下比较常见。另外因为没有提供仿真模型仿真只能跑 RTL。这意味着每次改配置都要重新综合一遍才能仿真迭代速度会受影响。缓解办法是把桥的行为抽象成一个简化模型用于系统级仿真只在最终验证阶段跑真实 RTL。这个取舍在项目周期紧的时候很实用。5. 避坑与排查五处最容易翻车的地方5.1 现象读回来的数据全 0 或者全 FF写进去没反应原因通常有两种。第一种是地址没对上——桥不做地址重映射AXI 侧发出去的地址原样出现在 APB 上。如果外设的地址译码是按自己的基地址做的而你在 AXI 侧给的地址区间和外设预期的不一致psel拉起来了但外设内部认为「这不是给我的」于是prdata保持默认值。第二种是prdata多路选择的默认支路漏了未命中时输出悬空或被综合成常量。排查方法很直接在波形上看m_apb_paddr的实际值和地址分配表逐个比对再看m_apb_psel哪一位起来了是不是你以为的那一位。两者一对问题立刻现形。解决上如果是地址问题要么在桥前面做地址偏移要么改外设的译码区间如果是多路选择问题补上默认支路。5.2 现象某个外设访问偶尔报 SLVERR重试又正常这是pready汇聚写错的最典型症状。如果未选中的从机pready常高而你没有和psel相与就直接或起来桥会认为传输已经完成但此时数据还没回来于是采到的是上一拍的残留值同时由于选择信号和数据不同步pslverr也可能被错误拉高。还有一种变体从机数量配成 8但顶层只连了 4 个剩下 4 位pready悬空。悬空在综合后可能被优化成 0也可能被优化成 1取决于工具心情这就是典型的玄学问题。解决办法就是把 4.2 节那段带psel门控的汇聚逻辑老老实实写全未使用的从机位显式接 0不要留悬空。顺手在综合报告里搜一下 unconnected port 的警告通常能提前发现。5.3 现象CPU 访问某个外设后彻底卡死看门狗都救不回来这是没开超时机制的后果。APB 从机如果在某种异常状态下不返回pready比如时钟没给、复位没释放、内部状态机跑飞桥就会一直等AXI 事务永远不完成主机端的所有后续访问全部堵住。因为 AXI4-Lite 是单 outstanding一个事务不结束整条通道就停了。解决方法是打开超时选项并且把超时值设成「最慢外设最坏响应时间的两倍」这个量级。同时要在软件侧确认收到SLVERR之后不要无限重试同一个地址否则错误会以另一种形式表现出来——系统看起来没死但一直在做无用功。这也是为什么超时值不能设得太小误报会导致本来正常的慢速外设被反复判错CPU 一直重试表现和卡死差不多。5.4 现象按字节写外设寄存器整个 32 位被覆盖如果外设需要字节选通比如一个寄存器里塞了四个独立配置字节而桥配的是 APB3那就没有pstrb信号可用外设只能整字更新。主机侧发wstrb4b0001想只改最低字节到了 APB 侧这个信息丢了外设把整个字写进去其余三个字节被覆盖成 AXI 写数据里的值——而那三个字节可能是 0。判断方法很简单看 IP 配置里选的是 APB3 还是 APB4再看外设端口的信号列表里有没有pstrb。如果没有而外设又确实需要按字节写那就必须回去改成 APB4 重新生成。这是个设计阶段的决策改起来要重综合越晚发现代价越大。所以在需求阶段就要问清楚每个外设的写粒度。顺带提一句安全属性如果方案里要做安全域隔离pprot同理——APB3 下这个信号根本不存在属性传不下去下游从机无法判断访问来源是安全世界还是普通世界。做 TEE 那类访问控制方案时APB4 是硬性前提。5.5 现象综合过了时序报告干净上板就是不对这类问题的嫌疑名单里时钟和复位排前两位。时钟方面检查是不是有人把分频后的时钟接到了s_axi_aclk上——桥只支持 1:1 同步一旦两个时钟不同源不同频时序分析会把它当成同一条路径因为只有一个时钟端口报告看起来完美实际行为完全错乱。复位方面检查s_axi_aresetn是不是直接接了外部按键或者上电复位中间没有做同步释放导致复位撤销的时刻随机落在时钟沿附近。排查手段是把内部状态引到 LED 或者 ILA 上看复位释放之后第一个事务能不能正常完成。如果第一次失败第二次成功基本可以锁定是复位同步问题。如果所有事务的数据都错但握手正常优先怀疑时钟。这两个方向确定之后改起来都不难难的是定位。6. 仿真验证与答辩验收怎么证明这座桥真的通了验证这座桥不需要多复杂的平台但用例必须覆盖到几个关键角落。一份够用的 test bench 清单大概是这样用例激励预期结果验收要点单次写向 UART 写 0x5Apsel有效penable拉高一拍pready后完成波形上 setup/access 两相清晰单次读从 GPIO 读prdata正确回传rrespOKAY读数据与预置值一致字节写wstrb4b0010仅第二字节被更新APB4 下验证pstrb读优先同时发起读写读先完成写后完成仲裁顺序可复现超时从机永不返回pready若干周期后rrespSLVERR超时值误差不超过 1 拍从机报错从机主动拉pslverrAXI 侧返回SLVERR与超时路径可区分背靠背连续两次读无气泡或固定气泡无丢事务跑仿真的时候波形上重点看四个地方。一是m_apb_penable是否严格只在 access 阶段为高如果它和psel同时拉起来说明状态机少了一拍。二是超时触发时psel/penable是否立刻撤回没撤就是 3.3 节说的错位隐患。三是m_apb_pprot是否和 AXI 侧的arprot/awprot对应做安全方案时这条必须逐拍核对。四是背靠背传输之间的间隔如果每次都要空好几拍说明内部有没必要的等待状态虽然功能对但性能打折。答辩环节老师一般不会问「这个 IP 有几个端口」这种查文档就能答的问题更容易问的是判断类问题。比如「为什么这里不能用 APB3」——你要能答出pstrb和pprot的缺失会带来什么具体后果而不是背「APB4 更新」。「如果外设不响应怎么办」——答超时机制和SLVERR上报路径。「地址能不能改」——答不能地址原样透传重映射要在外面做。这几个问题答得出来说明你是真跑过一遍的。还有一个加分项把资源占用和 FMAX 报出来和文档里的基准表对一下。单从机 APB4 配置下大约 119 个 Slice、286 个 LUT、200MHz如果你的实现结果偏离很多说明要么约束没写对要么周围逻辑拖累了它。这个对比能让方案显得有据可依不是拍脑袋写的。从那以后我每次做带总线的设计都会强制自己走一遍「地址表 → 端口汇聚 → 时钟复位 → 超时配置」这四步检查写在纸上打勾一步不落。这四步占不了十分钟但能省掉后面好几天的排查。这套流程也是从一次上板全错、查了两天发现是pready没门控开始的。希望帮到你。本文还有配套的精品资源点击获取
阅读完成 · 觉得有帮助?
咨询建站